Target
Dipeptidyl peptidase 8
Ligand
BDBM12191
Substrate
BDBM11526
Meas. Tech.
Enzyme Inhibition Assay
pH
8±n/a
Temperature
310.15±n/a K
IC50
78±n/a nM
Citation
 Jiaang, WTChen, YSHsu, TWu, SHChien, CHChang, CNChang, SPLee, SJChen, X Novel isoindoline compounds for potent and selective inhibition of prolyl dipeptidase DPP8. Bioorg Med Chem Lett 15:687-91 (2005)  
Target
Name:
Dipeptidyl peptidase 8
Synonyms:
DPP8 DPRP-1 Dipeptidyl peptidase 8 (DPP-8) Dipeptidyl peptidase 8/9 Dipeptidyl peptidase VIII Prolyl dipeptidase DPP8
Type:
Enzyme
Mol. Mass.:
103342.62
Organism:
Homo sapiens (Human)
Description:
Q6V1X1
Residue:
898
  
Inhibitor
Name:
BDBM12191
Synonyms:
(2S)-2-amino-2-cyclohexyl-1-(pyrrolidin-1-yl)ethan-1-one (S)-2-amino-2-cyclohexyl-1-(pyrrolidin-1-yl)ethanone isoquinoline derivative 14
Type:
Small organic molecule
Emp. Form.:
C12H22N2O
Mol. Mass.:
210.3159
SMILES:
N[C@@H](C1CCCCC1)C(=O)N1CCCC1
:
Substrate
Name:
BDBM11526
Synonyms:
1-(2-aminoacetyl)-N-(4-nitrophenyl)pyrrolidine-2-carboxamide Gly-Pro-pNA
Type:
Small organic molecule
Emp. Form.:
C13H16N4O4
Mol. Mass.:
292.2905
SMILES:
NCC(=O)N1CCCC1C(=O)Nc1ccc(cc1)[N+]([O-])=O
: