Target
Dipeptidyl peptidase 2
Ligand
BDBM11464
Substrate
BDBM12196
Meas. Tech.
Enzyme Inhibition Assay
IC50
68985±n/a nM
Citation
 Jiaang, WTChen, YSHsu, TWu, SHChien, CHChang, CNChang, SPLee, SJChen, X Novel isoindoline compounds for potent and selective inhibition of prolyl dipeptidase DPP8. Bioorg Med Chem Lett 15:687-91 (2005)  
Target
Name:
Dipeptidyl peptidase 2
Synonyms:
DAP II DPP2_HUMAN Dipeptidyl aminopeptidase II Dipeptidyl peptidase 2 (DPP2) Dipeptidyl peptidase II (DPP II) Dipeptidyl peptidase II and dipeptidyl peptidase IV (DPP2 and DPP4) carboxytripeptidase dipeptidyl(amino)peptidase II | dipeptidylarylamidase
Type:
Protein
Mol. Mass.:
54339.29
Organism:
Homo sapiens (Human)
Description:
Q9UHL4
Residue:
492
  
Inhibitor
Name:
BDBM11464
Synonyms:
(2S,3S)-2-amino-3-methyl-1-(1,3-thiazolidin-3-yl)pentan-1-one CHEMBL98408 thiazolidide 2
Type:
Small organic molecule
Emp. Form.:
C9H18N2OS
Mol. Mass.:
202.317
SMILES:
CC[C@H](C)[C@H](N)C(=O)N1CCSC1
:
Substrate
Name:
BDBM12196
Synonyms:
2,6-diamino-N-{1-[(4-nitrophenyl)carbamoyl]ethyl}hexanamide Lys-Ala-pNA
Type:
Emp. Form.:
Mol. Mass.:
SMILES:
: