Target
Tyrosine-protein kinase JAK2
Ligand
BDBM330872
Substrate
Meas. Tech.
Biochemical HTRF Assay Protocol
IC50
190±n/a nM
Citation
 Childers, MLDinsmore, CFuller, PGuerin, DKatz, JDPu, QScott, METhompson, CFZhang, HFalcone, DTorres, LBrubaker, JZeng, HCai, JDu, XWang, CBai, YKong, NLiu, YZheng, Z Cycloalkyl nitrile pyrazolo pyridones as Janus kinase inhibitors US Patent  US9725445 Publication Date 8/8/2017 
Target
Name:
Tyrosine-protein kinase JAK2
Synonyms:
JAK-2 JAK2_HUMAN Janus kinase 2 (JAK2) | Janus kinase 2 (a protein tyrosine kinase)
Type:
Protein
Mol. Mass.:
130684.68
Organism:
Homo sapiens (Human)
Description:
O60674
Residue:
1132
  
Inhibitor
Name:
BDBM330872
Synonyms:
US9725445, 3-53
Type:
Small organic molecule
Emp. Form.:
C24H28N6O3S
Mol. Mass.:
480.583
SMILES:
CC(C)(C)N1Cc2cc(Nc3nn([C@H]4CCCC[C@@H]4C#N)c4cc[nH]c(=O)c34)ccc2S1(=O)=O
: