Target
Tyrosine-protein kinase JAK1
Ligand
BDBM330916
Substrate
Meas. Tech.
Biochemical HTRF Assay Protocol
IC50
82.0±n/a nM
Citation
 Childers, MLDinsmore, CFuller, PGuerin, DKatz, JDPu, QScott, METhompson, CFZhang, HFalcone, DTorres, LBrubaker, JZeng, HCai, JDu, XWang, CBai, YKong, NLiu, YZheng, Z Cycloalkyl nitrile pyrazolo pyridones as Janus kinase inhibitors US Patent  US9725445 Publication Date 8/8/2017 
Target
Name:
Tyrosine-protein kinase JAK1
Synonyms:
JAK-1 JAK1A JAK1_HUMAN Janus kinase 1 (JAK1) | Janus kinase 1 JAK1
Type:
Protein
Mol. Mass.:
133293.73
Organism:
Homo sapiens (Human)
Description:
P23458
Residue:
1154
  
Inhibitor
Name:
BDBM330916
Synonyms:
US9725445, 3-97
Type:
Small organic molecule
Emp. Form.:
C22H19F3N6O2
Mol. Mass.:
456.4205
SMILES:
FC(F)(F)CN1Cc2cc(Nc3nn([C@H]4CCC[C@@H]4C#N)c4cc[nH]c(=O)c34)ccc2C1=O
: