Target
3-phosphoinositide-dependent protein kinase 1
Ligand
BDBM331160
Substrate
Meas. Tech.
Inhibition Assay
IC50
5500±n/a nM
Citation
 Dorsch, DSirrenberg, CMueller, TJMerkul, EKarapetyan, GA 7-azaindole derivatives US Patent  US9725446 Publication Date 8/8/2017 
Target
Name:
3-phosphoinositide-dependent protein kinase 1
Synonyms:
3-Phosphoinositide-Dependent Protein Kinase 1 (PDK1) 3-phosphoinositide-dependent protein kinase 1 3-phosphoinositide-dependent protein kinase 1 (PDK-1) Isoform 2 of 3-phosphoinositide-dependent protein kinase 1 PDPK1 Phosphoinositide-dependent protein kinase 1 (PDK1) hPDK1
Type:
Enzyme
Mol. Mass.:
63157.65
Organism:
Homo sapiens (Human)
Description:
O15530
Residue:
556
  
Inhibitor
Name:
BDBM331160
Synonyms:
1-methyl-3-(1H-pyrrolo[2,3-b]pyridin-3-yl)-1H-pyrrolo[2,3-c]pyridine | US9725446, Compound A19
Type:
Small organic molecule
Emp. Form.:
C15H12N4
Mol. Mass.:
248.2826
SMILES:
Cn1cc(-c2c[nH]c3ncccc23)c2ccncc12
: