Target
Bromodomain-containing protein 4 [1-477]/[333-460]/[44-168]/[44-460]
Ligand
BDBM331345
Substrate
Meas. Tech.
Time Resolved Fluorescence Resonance Energy Transfer (TR-FRET) Assay
IC50
<1±n/a nM
Citation
 Norris, DJVaccaro, WDeBenedetto, MVDegnan, APDelucca, GVDeskus, JAHan, WKumi, GKSchmitz, WDStarrett, Jr., JEHill, MDHuang, H Tricyclic compounds as anticancer agents US Patent  US9725449 Publication Date 8/8/2017 
Target
Name:
Bromodomain-containing protein 4 [1-477]/[333-460]/[44-168]/[44-460]
Synonyms:
Bromodomain BRD4
Type:
Protein
Mol. Mass.:
Description:
Components:
This complex has 4 components.
Component 1
Name:
Bromodomain-containing protein 4 [44-168]
Synonyms:
BET bromodomain 4(1) (BRD4(1)) BRD4-BD1 protein (aa 44-168) Bromodomain protein 4 (BRD4-BD1) Bromodomain-containing protein 4 (BRD4) (aa 44-168) Bromodomain-containing protein 4 bromodomain 1 (BRD4-BD1) | HUNK1
Type:
Enzyme Catalytic Domain
Mol. Mass.:
14866.49
Organism:
Homo sapiens (Human)
Description:
aa (44-168)
Residue:
125
  
Component 2
Name:
Bromodomain-containing protein 4 [333-460]
Synonyms:
BET bromodomain 4(2) (BRD4(2)) BRD4_HUMAN HUNK1
Type:
Enzyme Catalytic Domain
Mol. Mass.:
14818.38
Organism:
Homo sapiens (Human)
Description:
aa (333-460)
Residue:
128
  
Component 3
Name:
Bromodomain-containing protein 4 [1-477]
Synonyms:
BRD4 Bromodomain-containing protein 4 (BRD4 (aa 1-477) HUNK1
Type:
Enzyme Catalytic Domain
Mol. Mass.:
53061.90
Organism:
Homo sapiens (Human)
Description:
aa (1-477)
Residue:
477
  
Component 4
Name:
Bromodomain-containing protein 4 [44-460]
Synonyms:
BRD4 Bromodomain-containing protein 4 (BRD4) | HUNK1
Type:
Enzyme Catalytic Domain
Mol. Mass.:
47039.29
Organism:
Homo sapiens (Human)
Description:
aa (44-460)
Residue:
417
  
Inhibitor
Name:
BDBM331345
Synonyms:
1-[5-(Dimethyl-1H-1,2,3-triazol-5-yl)-8-[(S)-oxan-4-yl(phenyl)methyl]-3,8,10-triazatricyclo[7.4.0.02,7]trideca-1(9),2 | US9725449, Example 179
Type:
Small organic molecule
Emp. Form.:
C29H31N7O2
Mol. Mass.:
509.6021
SMILES:
Cc1nnn(C)c1-c1cnc2c(c1)n([C@@H](C1CCOCC1)c1ccccc1)c1nc(ccc21)N1CC(O)C1
: