Target
Cathepsin S
Ligand
BDBM331540
Substrate
Meas. Tech.
Enzyme Assay
Ki
103±n/a nM
Citation
 Nardi, ARatcliffe, PCraan, THertrampf, TLesch, BKime, RSteinhagen, H 3-oxo-tetrahydro-furo[3,2-B]pyrrol-4(5H)-yl) derivatives I US Patent  US9725459 Publication Date 8/8/2017 
Target
Name:
Cathepsin S
Synonyms:
CATS_HUMAN Cathepsin S (Cat S) | cathepsin S preproprotein
Type:
Protein
Mol. Mass.:
37507.38
Organism:
Homo sapiens (Human)
Description:
P25774
Residue:
331
  
Inhibitor
Name:
BDBM331540
Synonyms:
N-((S)-2-((3aS,6S,6aS)-6-chloro-3-oxotetrahydro-2H-furo[3,2-b]pyrrol-4(5H)-yl)-1-cyclohexyl-2-oxoethyl)-5-(pyridin-4-yl)thiophene-2-carboxamide (3) | US9725459, 3
Type:
Small organic molecule
Emp. Form.:
C24H28ClN3O4S
Mol. Mass.:
490.015
SMILES:
O[C@H]1CO[C@@H]2[C@@H](Cl)CN([C@H]12)C(=O)[C@@H](NC(=O)c1ccc(s1)-c1ccncc1)C1CCCCC1
: