Target
Cathepsin K
Ligand
BDBM331542
Substrate
Meas. Tech.
Enzyme Assay
Ki
31.0±n/a nM
Citation
 Nardi, ARatcliffe, PCraan, THertrampf, TLesch, BKime, RSteinhagen, H 3-oxo-tetrahydro-furo[3,2-B]pyrrol-4(5H)-yl) derivatives I US Patent  US9725459 Publication Date 8/8/2017 
Target
Name:
Cathepsin K
Synonyms:
CATK_HUMAN CTSO Cathepsin O Cathepsin X
Type:
Enzyme
Mol. Mass.:
36975.68
Organism:
Homo sapiens (Human)
Description:
P43235
Residue:
329
  
Inhibitor
Name:
BDBM331542
Synonyms:
N-((S)-2-((3aS,6S,6aS)-6-chloro-3-oxotetrahydro-2H-furo[3,2-b]pyrrol-4(5H)-yl)-1-cyclohexyl-2-oxoethyl)-5-(pyrimidin-5-yl)thiophene-2-carboxamide (5) | US9725459, 5
Type:
Small organic molecule
Emp. Form.:
C23H25ClN4O4S
Mol. Mass.:
488.987
SMILES:
Cl[C@H]1CN([C@H]2[C@@H]1OCC2=O)C(=O)[C@@H](NC(=O)c1ccc(s1)-c1cncnc1)C1CCCCC1
: