Target
Receptor-type tyrosine-protein kinase FLT3
Ligand
BDBM331651
Substrate
Meas. Tech.
Competition Binding Assay
Kd
<5±n/a nM
Citation
 Holladay, MWLiu, GRowbottom, MW Biaryl acetamide compounds and methods of use thereof US Patent  US9725465 Publication Date 8/8/2017 
Target
Name:
Receptor-type tyrosine-protein kinase FLT3
Synonyms:
CD135 FL cytokine receptor FLK2 FLT3 Fetal liver kinase-2 Fms-like tyrosine kinase 3 (Flt-3) STK-1 Stem cell tyrosine kinase 1
Type:
Enzyme
Mol. Mass.:
112888.62
Organism:
Homo sapiens (Human)
Description:
P36888
Residue:
993
  
Inhibitor
Name:
BDBM331651
Synonyms:
Preparation of 5-(4-(2-((5-(tert-butyl)isoxazol-3-yl)amino)-2-oxoethyl)phenyl)-N-(1-methylpiperidin-4-yl)-1H-pyrrolo[2,3-b]pyridine-2-carboxamide | US9725465, Example 69
Type:
Small organic molecule
Emp. Form.:
C29H34N6O3
Mol. Mass.:
514.6187
SMILES:
CN1CCC(CC1)NC(=O)c1cc2cc(cnc2[nH]1)-c1ccc(CC(=O)Nc2cc(on2)C(C)(C)C)cc1
: