Target
Receptor-type tyrosine-protein kinase FLT3
Ligand
BDBM331802
Substrate
Meas. Tech.
Competition Binding Assay
Kd
<5±n/a nM
Citation
 Holladay, MWLiu, GRowbottom, MW Biaryl acetamide compounds and methods of use thereof US Patent  US9725465 Publication Date 8/8/2017 
Target
Name:
Receptor-type tyrosine-protein kinase FLT3
Synonyms:
CD135 FL cytokine receptor FLK2 FLT3 Fetal liver kinase-2 Fms-like tyrosine kinase 3 (Flt-3) STK-1 Stem cell tyrosine kinase 1
Type:
Enzyme
Mol. Mass.:
112888.62
Organism:
Homo sapiens (Human)
Description:
P36888
Residue:
993
  
Inhibitor
Name:
BDBM331802
Synonyms:
US9725465, Example 223
Type:
Small organic molecule
Emp. Form.:
C31H29F4N5O5
Mol. Mass.:
627.5861
SMILES:
COc1cc2nc(cnc2cc1OCCN1CC2CC(C1)O2)-c1ccc(CC(=O)Nc2cc(on2)C2(CC2)C(F)(F)F)c(F)c1
: