Target
Mast/stem cell growth factor receptor Kit
Ligand
BDBM331824
Substrate
Meas. Tech.
Competition Binding Assay
Kd
<5±n/a nM
Citation
 Holladay, MWLiu, GRowbottom, MW Biaryl acetamide compounds and methods of use thereof US Patent  US9725465 Publication Date 8/8/2017 
Target
Name:
Mast/stem cell growth factor receptor Kit
Synonyms:
CD117 antigen KIT Mast/stem cell growth factor receptor Kit (cKIT) Proto-oncogene tyrosine-protein kinase Kit Stem cell growth factor receptor Tyrosine-protein kinase Kit c-kit v-kit Hardy-Zuckerman 4 feline sarcoma viral oncogene homolog
Type:
Protein
Mol. Mass.:
109869.37
Organism:
Homo sapiens (Human)
Description:
P10721
Residue:
976
  
Inhibitor
Name:
BDBM331824
Synonyms:
US9725465, Example 245
Type:
Small organic molecule
Emp. Form.:
C32H31F4N5O5
Mol. Mass.:
641.6127
SMILES:
COc1cc2nc(cnc2cc1OCCN1C2CCC1COC2)-c1ccc(CC(=O)Nc2cc(on2)C2(CC2)C(F)(F)F)c(F)c1
: