Target
Interleukin-6
Ligand
BDBM331841
Substrate
Meas. Tech.
IL-6 Production Inhibitory Action Evaluation
IC50
13.0±n/a nM
Citation
 Kawashima, KYamazaki, YTakaoka, SShii, DOda, TMatsuyama, T [4-(1,3,3-trimethyl-2-oxo-3,4-dihydro-1H-quinoxalin-7-yl)phenoxy]ethyloxy compound or salt thereof US Patent  US10189796 Publication Date 1/29/2019 
Target
Name:
Interleukin-6
Synonyms:
B-cell stimulatory factor 2 CDF Hybridoma growth factor IFNB2 IL6 Interferon beta-2
Type:
Mol. Mass.:
23717.96
Organism:
Homo sapiens (Human)
Description:
P05231
Residue:
212
  
Inhibitor
Name:
BDBM331841
Synonyms:
(S)-7-[4-(3-cyano-2-hydroxypropyl)oxy-2-methoxyphenyl]-8-(5-fluoro-2-methyl-phenoxymethyl)-1,3,3-trimethyl-3,4-dihydro-1H-quinoxalin-2-one US10435379, Compound 5-2
Type:
Small organic molecule
Emp. Form.:
C30H32FN3O5
Mol. Mass.:
533.5906
SMILES:
COc1cc(OC[C@@H](O)CC#N)ccc1-c1ccc2NC(C)(C)C(=O)N(C)c2c1COc1cc(F)ccc1C
: