Target
Cyclin-dependent kinase 4/G1/S-specific cyclin-D1
Ligand
BDBM331846
Substrate
IC50
453±n/a nM
Citation
 Tavares, FXStrum, JC CDK inhibitors US Patent  US10189849 Publication Date 1/29/2019 
Target
Name:
Cyclin-dependent kinase 4/G1/S-specific cyclin-D1
Synonyms:
CDK4/CycD CDK4/Cyclin D1 Cyclin-Dependent Kinase 4 (CDK4) Cyclin-dependent kinase 4/G1/S-specific cyclin D1 | Cyclin-dependent kinase 4/cyclin D1
Type:
Protein Complex
Mol. Mass.:
Description:
CDK4/D1 complexes were purified from insect cells co-infected with baculovirus vectors containing each of the components.
Components:
This complex has 2 components.
Component 1
Name:
Cyclin-dependent kinase 4
Synonyms:
CDK4 Cell division protein kinase 4 PSK-J3
Type:
Enzyme Subunit
Mol. Mass.:
33731.96
Organism:
Homo sapiens (Human)
Description:
P11802
Residue:
303
  
Component 2
Name:
G1/S-specific cyclin-D1
Synonyms:
B-cell lymphoma 1 protein BCL-1 oncogene CCND1 PRAD1 | PRAD1 oncogene
Type:
Enzyme Subunit
Mol. Mass.:
33717.70
Organism:
Homo sapiens (Human)
Description:
Residue:
295
  
Inhibitor
Name:
BDBM331846
Synonyms:
US10189849, Compound 1 US10927120, Compound 1 | US9957276, Compound 1
Type:
Small organic molecule
Emp. Form.:
C19H22N8O
Mol. Mass.:
378.431
SMILES:
CN1CCN(CC1)c1ccc(Nc2ncc3cc4C(=O)NCCn4c3n2)nc1
: