Target
Cyclin-dependent kinase 2/G1/S-specific cyclin-E1
Ligand
BDBM331873
Substrate
Meas. Tech.
Biological Activity
IC50
50500±n/a nM
Citation
 Tavares, FXStrum, JC CDK inhibitors US Patent  US10189849 Publication Date 1/29/2019 
Target
Name:
Cyclin-dependent kinase 2/G1/S-specific cyclin-E1
Synonyms:
CDK2/CycE CDK2/E Cyclin-Dependent Kinase 2 (CDK2) Cyclin-dependent kinase 2/cyclin E1
Type:
Protein
Mol. Mass.:
Description:
Components:
This complex has 2 components.
Component 1
Name:
Cyclin-dependent kinase 2
Synonyms:
CDK2 CDK2_HUMAN Cell division protein kinase 2 Protein cereblon/Cyclin-dependent kinase 2 | p33 protein kinase
Type:
Enzyme Subunit
Mol. Mass.:
33938.17
Organism:
Homo sapiens (Human)
Description:
P24941
Residue:
298
  
Component 2
Name:
G1/S-specific cyclin-E1
Synonyms:
CCNE CCNE1_HUMAN
Type:
Enzyme Subunit
Mol. Mass.:
47073.17
Organism:
Homo sapiens (Human)
Description:
Residue:
410
  
Inhibitor
Name:
BDBM331873
Synonyms:
US10189849, Compound 25 US9957276, Compound 25
Type:
Small organic molecule
Emp. Form.:
C21H26N8O
Mol. Mass.:
406.4841
SMILES:
CC(C)[C@@H]1Cn2c(cc3cnc(Nc4ccc(cn4)N4CCNCC4)nc23)C(=O)N1
: