Target
Vascular endothelial growth factor receptor 2
Ligand
BDBM50069097
Substrate
Meas. Tech.
RTK inhibitory activity
IC50
38.5±4.7 nM
Citation
 Gangjee, A Conformationally restricted 4-substituted-2,6-dimethylfuro[2,3-d]pyrimidines as anti-tumor agents US Patent  US10189853 Publication Date 1/29/2019 
Target
Name:
Vascular endothelial growth factor receptor 2
Synonyms:
CD_antigen=CD309 Fetal liver kinase 1 (FLK-1) KDR Protein-tyrosine kinase receptor Flk-1 VEGFR-2 VEGFR2 Vascular Endothelial Growth Factor Receptor Kinase 2 Vascular endothelial growth factor receptor 2 (KDR) Vascular endothelial growth factor receptor 2 (VEGFR2) Vascular endothelial growth factor receptor-2 (VEGFR-2)
Type:
Receptor Tyrosine Kinase
Mol. Mass.:
151510.97
Organism:
Homo sapiens (Human)
Description:
P35968
Residue:
1356
  
Inhibitor
Name:
BDBM50069097
Synonyms:
CHEMBL3403518 | US10189853, Compound 11
Type:
Small organic molecule
Emp. Form.:
C18H21N3O2
Mol. Mass.:
311.3782
SMILES:
CC(C)Oc1ccc(cc1)N(C)c1nc(C)nc2oc(C)cc12
: