Target
Platelet-derived growth factor receptor alpha
Ligand
BDBM50069097
Substrate
Meas. Tech.
RTK inhibitory activity
IC50
84.0±10.0 nM
Citation
 Gangjee, A Conformationally restricted 4-substituted-2,6-dimethylfuro[2,3-d]pyrimidines as anti-tumor agents US Patent  US10189853 Publication Date 1/29/2019 
Target
Name:
Platelet-derived growth factor receptor alpha
Synonyms:
Alpha-type platelet-derived growth factor receptor PDGFRA PGFRA_HUMAN Platelet-derived growth factor receptor alpha (PDGFRA) RHEPDGFRA
Type:
Protein
Mol. Mass.:
122633.38
Organism:
Homo sapiens (Human)
Description:
P16234
Residue:
1089
  
Inhibitor
Name:
BDBM50069097
Synonyms:
CHEMBL3403518 | US10189853, Compound 11
Type:
Small organic molecule
Emp. Form.:
C18H21N3O2
Mol. Mass.:
311.3782
SMILES:
CC(C)Oc1ccc(cc1)N(C)c1nc(C)nc2oc(C)cc12
: