Target
cAMP-specific 3',5'-cyclic phosphodiesterase 4B
Ligand
BDBM332192
Substrate
Meas. Tech.
cAMP HTRF Assay to Determine the Activity of hPDE4B1
IC50
<100±n/a nM
Citation
 Nardi, AJakob, FKonetzki, ICraan, THesslinger, CDoodeman, R Substituted pyrimidine compounds US Patent  US10189854 Publication Date 1/29/2019 
Target
Name:
cAMP-specific 3',5'-cyclic phosphodiesterase 4B
Synonyms:
3',5'-cyclic phosphodiesterase Isoform PDE4B1 PDE4B PDE4B_HUMAN Phosphodiesterase 4B (PDE4B) Phosphodiesterase Type 4 (PDE4B)
Type:
Protein
Mol. Mass.:
83318.87
Organism:
Homo sapiens (Human)
Description:
Q07343
Residue:
736
  
Inhibitor
Name:
BDBM332192
Synonyms:
US10189854, Compound 151 | [1-[5-(6-Fluoro-pyridin-2-yl)-pyrimidin-2-yl]-spiro[1,2-dihydro-indole-3,1'-cyclopropane]-6-yl]-morpholin-4-yl-methanone
Type:
Small organic molecule
Emp. Form.:
C24H22FN5O2
Mol. Mass.:
431.4622
SMILES:
Fc1cccc(n1)-c1cnc(nc1)N1CC2(CC2)c2ccc(cc12)C(=O)N1CCOCC1
: