Target
cAMP-specific 3',5'-cyclic phosphodiesterase 4B
Ligand
BDBM332380
Substrate
Meas. Tech.
cAMP HTRF Assay to Determine the Activity of hPDE4B1
IC50
<100±n/a nM
Citation
 Nardi, AJakob, FKonetzki, ICraan, THesslinger, CDoodeman, R Substituted pyrimidine compounds US Patent  US10189854 Publication Date 1/29/2019 
Target
Name:
cAMP-specific 3',5'-cyclic phosphodiesterase 4B
Synonyms:
3',5'-cyclic phosphodiesterase Isoform PDE4B1 PDE4B PDE4B_HUMAN Phosphodiesterase 4B (PDE4B) Phosphodiesterase Type 4 (PDE4B)
Type:
Protein
Mol. Mass.:
83318.87
Organism:
Homo sapiens (Human)
Description:
Q07343
Residue:
736
  
Inhibitor
Name:
BDBM332380
Synonyms:
US10189854, Compound 344
Type:
Small organic molecule
Emp. Form.:
C25H25N5O3S
Mol. Mass.:
475.563
SMILES:
CS(=O)c1ccnc(c1)-c1cnc(nc1)N1CC2(CC2)c2ccc(cc12)C(=O)N1CCOCC1
: