Target
Sodium channel protein type 9 subunit alpha
Ligand
BDBM331872
Substrate
Meas. Tech.
Ex-Vivo Potencies in Inactivated state
IC50
<50000±n/a nM
Citation
 Sharma, PKhatri, VKGu, XSong, YShen, MLRiggs-Sauthier, JAnand, NKKozlowski, AOdinecs, ARiley, TARen, ZMu, YShen, XYuan, XAurrecoechea, NO Mahony, DJDeng, B Derivatives of 6-(2,3-dichlorophenyl)-1,2,4-triazin-5-amine US Patent  US10189859 Publication Date 1/29/2019 
Target
Name:
Sodium channel protein type 9 subunit alpha
Synonyms:
NENA Peripheral sodium channel 1 SCN9A_HUMAN Voltage-gated sodium channel subunit Nav1.7 hNE-Na
Type:
Protein
Mol. Mass.:
226375.97
Organism:
Homo sapiens (Human)
Description:
Q15858
Residue:
1988
  
Inhibitor
Name:
BDBM331872
Synonyms:
US10189859, Compound 120
Type:
Small organic molecule
Emp. Form.:
C18H22Cl2N6O
Mol. Mass.:
409.313
SMILES:
Nc1nc(nnc1-c1cccc(Cl)c1Cl)N1CCN(CC1)C1CCOCC1
: