Target
Sodium channel protein type 9 subunit alpha
Ligand
BDBM331939
Substrate
Meas. Tech.
Ex-Vivo Potencies in Inactivated state
IC50
<50000±n/a nM
Citation
 Sharma, PKhatri, VKGu, XSong, YShen, MLRiggs-Sauthier, JAnand, NKKozlowski, AOdinecs, ARiley, TARen, ZMu, YShen, XYuan, XAurrecoechea, NO Mahony, DJDeng, B Derivatives of 6-(2,3-dichlorophenyl)-1,2,4-triazin-5-amine US Patent  US10189859 Publication Date 1/29/2019 
Target
Name:
Sodium channel protein type 9 subunit alpha
Synonyms:
NENA Peripheral sodium channel 1 SCN9A_HUMAN Voltage-gated sodium channel subunit Nav1.7 hNE-Na
Type:
Protein
Mol. Mass.:
226375.97
Organism:
Homo sapiens (Human)
Description:
Q15858
Residue:
1988
  
Inhibitor
Name:
BDBM331939
Synonyms:
6-(2,3-dichlorophenyl)-N3-(3-(2-(2-methoxyethoxy)ethoxy)-2-methylpropyl)-1,2,4-triazine-3,5-diamine | US10189859, Compound 177
Type:
Small organic molecule
Emp. Form.:
C18H25Cl2N5O3
Mol. Mass.:
430.329
SMILES:
COCCOCCOCC(C)CNc1nnc(c(N)n1)-c1cccc(Cl)c1Cl
: