Target
Free fatty acid receptor 1
Ligand
BDBM300899
Substrate
Meas. Tech.
GPR40 Calcium Flux Assay
EC50
4.00±n/a nM
Citation
 Liang, YDemarest, KT GPR40 agonists in anti-diabetic drug combinations US Patent  US10195178 Publication Date 2/5/2019 
Target
Name:
Free fatty acid receptor 1
Synonyms:
FFAR1 G-protein Coupled Receptor 40 | GPR40
Type:
G Protein-Coupled Receptor (GPCR)
Mol. Mass.:
31473.32
Organism:
Homo sapiens (Human)
Description:
O14842
Residue:
300
  
Inhibitor
Name:
BDBM300899
Synonyms:
3-(4-((3-(2- Methylphenyl)benzo[b]thiophen- 5-yl)methoxy)phenyl) hex-4-ynoic acid US10195178, Compound 97 | US9790198, Compound 97
Type:
Small organic molecule
Emp. Form.:
C28H24O3S
Mol. Mass.:
440.553
SMILES:
CC#CC(CC(O)=O)c1ccc(OCc2ccc3scc(-c4ccccc4C)c3c2)cc1
: