Target
Coagulation factor X
Ligand
BDBM12396
Substrate
BDBM12500
Meas. Tech.
Factor Xa Inhibition Assay
Ki
0.07±n/a nM
Citation
 Nazare, MWill, DWMatter, HSchreuder, HRitter, KUrmann, MEssrich, MBauer, AWagner, MCzech, JLorenz, MLaux, VWehner, V Probing the subpockets of factor Xa reveals two binding modes for inhibitors based on a 2-carboxyindole scaffold: a study combining structure-activity relationship and X-ray crystallography. J Med Chem 48:4511-25 (2005)  
Target
Name:
Coagulation factor X
Synonyms:
Activated coagulation factor X (FXa) Coagulation factor X precursor F10 Factor X heavy chain Factor Xa Stuart-Prower factor
Type:
Enzyme
Mol. Mass.:
54726.60
Organism:
Homo sapiens (Human)
Description:
Residue:
488
  
Inhibitor
Name:
BDBM12396
Synonyms:
1-[5-(5-Chlorothiophen-2-yl)isoxazol-3-ylmethyl]-3-cyano-7-methyl-1H-indole-2- carboxylic Acid (1-Isopropylpiperidin-4-yl)amide 2-Carboxyindole Scaffold 21
Type:
Small organic molecule
Emp. Form.:
C27H28ClN5O2S
Mol. Mass.:
522.062
SMILES:
CC(C)N1CCC(CC1)NC(=O)c1c(C#N)c2cccc(C)c2n1Cc1cc(on1)-c1ccc(Cl)s1
:
Substrate
Name:
BDBM12500
Synonyms:
Cbz-D-Arg-Gly-L-Arg-pNA N-a-Benzyloxycarbonyl-Darginyl-L-glycyl-L-arginine-pnitroaniline benzyl N-[(1R)-4-carbamimidamido-1-[({[(1S)-4-carbamimidamido-1-[(4-nitrophenyl)carbamoyl]butyl]carbamoyl}methyl)carbamoyl]butyl]carbamate
Type:
Small organic molecule
Emp. Form.:
C28H39N11O7
Mol. Mass.:
641.6788
SMILES:
[#7]\[#6](-[#7])=[#7]/[#6]-[#6]-[#6]-[#6@@H](-[#7]-[#6](=O)-[#8]-[#6]-c1ccccc1)-[#6](=O)-[#7]-[#6]-[#6](=O)-[#7]-[#6@@H](-[#6]-[#6]-[#6]-[#7+]=[#6](-[#7])-[#7-])-[#6](=O)-[#7]-c1ccc(cc1)-[#7+](-[#8-])=O
: