Target
E3 ubiquitin-protein ligase SMURF1
Ligand
BDBM239098
Substrate
Meas. Tech.
Pharmaceutical Assay
IC50
33.0±n/a nM
Citation
 Bala, KJBrearley, ADale, JEdwards, AAhmed, MPorter, DPulz, RARooney, LASandham, DAShaw, DSmith, NTaylor, JLTaylor, RJTroxler, TJWrigglesworth, J Carboxamide derivatives US Patent  US10195181 Publication Date 2/5/2019 
Target
Name:
E3 ubiquitin-protein ligase SMURF1
Synonyms:
E3 ubiquitin-protein ligase SMURF1 KIAA1625 SMAD-specific E3 ubiquitin-protein ligase 1 SMURF1 | hSMURF1
Type:
PROTEIN
Mol. Mass.:
86120.64
Organism:
Homo sapiens (Human)
Description:
ChEMBL_116984
Residue:
757
  
Inhibitor
Name:
BDBM239098
Synonyms:
US10195181, Example 1.7 | US9403810, 1.7
Type:
Small organic molecule
Emp. Form.:
C23H29F3N4O3
Mol. Mass.:
466.4966
SMILES:
Cc1c(noc1C1=CCC(CC1)C(F)(F)F)C(=O)Nc1c(C)n(C)n(C2CCCCC2)c1=O
: