Target
Aurora kinase A
Ligand
BDBM12405
Substrate
Biotinylated Peptide Substrate
Meas. Tech.
Recombinant Aurora A Enzyme Assay
pH
7.5±n/a
Temperature
295.15±n/a K
IC50
3±n/a nM
Citation
 Heron, NMAnderson, MBlowers, DPBreed, JEden, JMGreen, SHill, GBJohnson, TJung, FHMcMiken, HHPannifer, ADPauptit, RAPink, JRoberts, NJ SAR and inhibitor complex structure determination of a novel class of potent and specific Aurora kinase inhibitors. Bioorg Med Chem Lett 16:1320-23 (2006)  
Target
Name:
Aurora kinase A
Synonyms:
AIK ARK1 AURKA AYK1 Aurora kinase A (AURA) Aurora kinase A (Aurora A) Aurora-related kinase 1 BTAK Breast-tumor-amplified kinase STK15 Serine/threonine kinase 15 Serine/threonine-protein kinase aurora A hARK1
Type:
Serine/threonine-protein kinase
Mol. Mass.:
45830.98
Organism:
Homo sapiens (Human)
Description:
O14965
Residue:
403
  
Inhibitor
Name:
BDBM12405
Synonyms:
CHEMBL381724 quinazoline deriv. 3
Type:
Small organic molecule
Emp. Form.:
C27H29N7O4
Mol. Mass.:
515.5637
SMILES:
COc1cc2c(Nc3cnc(NC(=O)c4ccccc4)nc3)ncnc2cc1OCCCN1CCOCC1
:
Substrate
Name:
Biotinylated Peptide Substrate
Synonyms:
Type:
Peptide
Mol. Mass.:
1889.16
Organism:
Description:
Residue:
16
ITINTETRALRRWSLG