Target
Metabotropic glutamate receptor 3
Ligand
BDBM196331
Substrate
Metabotropic glutamate receptor 5 (mGlu5)
Meas. Tech.
mGlu5 Ca2+ Flux Assay
Temperature
298.15±n/a K
IC50
462±n/a nM
Comments
extracted
Citation
 Conn, PJLindsley, CWEmmitte, KAEngers, JLKonkol, LC Substituted pyrazolo[1,5-a]pyrazines as negative allosteric modulators of metabotropic glutamate receptor 3 US Patent  US9676782 Publication Date 6/13/2017 
Target
Name:
Metabotropic glutamate receptor 3
Synonyms:
GRM3_RAT Grm3 glutamate receptor, metabotropic 3 precursor
Type:
Protein
Mol. Mass.:
98971.84
Organism:
Rattus norvegicus (Rat)
Description:
P31422
Residue:
879
  
Inhibitor
Name:
BDBM196331
Synonyms:
2-(((3,4-difluorophenyl)amino)methyl)-5-(4-fluorophenyl)-6,7-dihydropyrazolo[1,5-a]pyrazin-4(5h)-one | US9676782, 31
Type:
Small organic molecule
Emp. Form.:
C19H15F3N4O
Mol. Mass.:
372.3438
SMILES:
Fc1ccc(cc1)N1CCn2nc(CNc3ccc(F)c(F)c3)cc2C1=O
:
Substrate
Name:
Metabotropic glutamate receptor 5
Synonyms:
GRM5_RAT Grm5 Mglur5 metabotropic glutamate 5/1-C metabotropic glutamate 5a
Type:
Enzyme
Mol. Mass.:
131900.14
Organism:
Rattus norvegicus (Rat)
Description:
P31424
Residue:
1203