Target
Metabotropic glutamate receptor 5
Ligand
BDBM196606
Substrate
Metabotropic glutamate receptor 5 (mGlu5)
Meas. Tech.
mGlu3 Ca2+ Flux Assay
Temperature
298.15±n/a K
IC50
1360±n/a nM
Comments
extracted
Citation
 Conn, PJLindsley, CWEmmitte, KAEngers, JLKonkol, LC Substituted pyrazolo[1,5-a]pyrazines as negative allosteric modulators of metabotropic glutamate receptor 3 US Patent  US9676782 Publication Date 6/13/2017 
Target
Name:
Metabotropic glutamate receptor 5
Synonyms:
GRM5_RAT Grm5 Mglur5 metabotropic glutamate 5/1-C metabotropic glutamate 5a
Type:
Enzyme
Mol. Mass.:
131900.14
Organism:
Rattus norvegicus (Rat)
Description:
P31424
Residue:
1203
  
Inhibitor
Name:
BDBM196606
Synonyms:
(s)-5-(4-fluorophenyl)-7-methyl-2-((phenylamino)methyl)-6,7-dihydropyrazolo[1,5-a]pyrazin-4(5h)-one | US9676782, 41
Type:
Small organic molecule
Emp. Form.:
C20H19FN4O
Mol. Mass.:
350.3895
SMILES:
C[C@H]1CN(C(=O)c2cc(CNc3ccccc3)nn12)c1ccc(F)cc1
:
Substrate
Name:
Metabotropic glutamate receptor 5
Synonyms:
GRM5_RAT Grm5 Mglur5 metabotropic glutamate 5/1-C metabotropic glutamate 5a
Type:
Enzyme
Mol. Mass.:
131900.14
Organism:
Rattus norvegicus (Rat)
Description:
P31424
Residue:
1203