Target
Phosphodiesterase
Ligand
BDBM331964
Substrate
Meas. Tech.
PDE2A3 assay
Ki
19.0±n/a nM
Citation
 Shen, DWilson, JEMcCracken, T Heteroaryl-pyrimidinone compounds as PDE2 inhibitors US Patent  US10195201 Publication Date 2/5/2019 
Target
Name:
Phosphodiesterase
Synonyms:
PDE2A3 | Phosphodiesterase A3 (PDE2A3)
Type:
Enzyme Catalytic Domain
Mol. Mass.:
105547.91
Organism:
Macaca mulatta (Rhesus macaque)
Description:
Residue:
941
  
Inhibitor
Name:
BDBM331964
Synonyms:
US10195201, Example 4 | US10195201, Example 5
Type:
Small organic molecule
Emp. Form.:
C16H12F4N4OS
Mol. Mass.:
384.351
SMILES:
C[C@H](c1nnc(s1)-c1cc(=O)[nH]c(C)n1)c1ccc(cc1F)C(F)(F)F
: