Target
Phosphodiesterase
Ligand
BDBM331975
Substrate
Meas. Tech.
PDE2A3 assay
Ki
46.0±n/a nM
Citation
 Shen, DWilson, JEMcCracken, T Heteroaryl-pyrimidinone compounds as PDE2 inhibitors US Patent  US10195201 Publication Date 2/5/2019 
Target
Name:
Phosphodiesterase
Synonyms:
PDE2A3 | Phosphodiesterase A3 (PDE2A3)
Type:
Enzyme Catalytic Domain
Mol. Mass.:
105547.91
Organism:
Macaca mulatta (Rhesus macaque)
Description:
Residue:
941
  
Inhibitor
Name:
BDBM331975
Synonyms:
US10195201, Example 14 | US10195201, Example 15
Type:
Small organic molecule
Emp. Form.:
C17H14F4N4O
Mol. Mass.:
366.3129
SMILES:
C[C@@H](c1ccc(cc1F)C(F)(F)F)n1cnc(c1)-c1cc(=O)[nH]c(C)n1
: