Target
Phosphodiesterase
Ligand
BDBM331979
Substrate
Meas. Tech.
PDE2A3 assay
Ki
0.400±n/a nM
Citation
 Shen, DWilson, JEMcCracken, T Heteroaryl-pyrimidinone compounds as PDE2 inhibitors US Patent  US10195201 Publication Date 2/5/2019 
Target
Name:
Phosphodiesterase
Synonyms:
PDE2A3 | Phosphodiesterase A3 (PDE2A3)
Type:
Enzyme Catalytic Domain
Mol. Mass.:
105547.91
Organism:
Macaca mulatta (Rhesus macaque)
Description:
Residue:
941
  
Inhibitor
Name:
BDBM331979
Synonyms:
(R)- or (S)-2- (3,4-dimethoxy- benzyl)-6-(1-(1- (2-fluoro-4- (trifluoromethyl) phenyl)ethyl)- 1H-imidazol-4- yl)pyrimidin- 4(3H)-one US10195201, Example 19
Type:
Small organic molecule
Emp. Form.:
C25H22F4N4O3
Mol. Mass.:
502.4608
SMILES:
COc1ccc(Cc2nc(cc(=O)[nH]2)-c2cn(cn2)C(C)c2ccc(cc2F)C(F)(F)F)cc1OC
: