Target
cGMP-dependent 3',5'-cyclic phosphodiesterase
Ligand
BDBM332014
Substrate
Meas. Tech.
TBD
Ki
65.0±n/a nM
Citation
 Shen, DWilson, JEMcCracken, T Heteroaryl-pyrimidinone compounds as PDE2 inhibitors US Patent  US10195201 Publication Date 2/5/2019 
Target
Name:
cGMP-dependent 3',5'-cyclic phosphodiesterase
Synonyms:
CGS-PDE Homo sapiens phosphodiesterase 2A (PDE2A) PDE2A cGSPDE
Type:
Enzyme Catalytic Domain
Mol. Mass.:
105691.58
Organism:
Homo sapiens (Human)
Description:
O00408
Residue:
941
  
Inhibitor
Name:
BDBM332014
Synonyms:
(R)- or (S)-6''- (1-(4-(1,1- difluoro- ethyl)phenyl) ethyl)-2- methyl-[4,4''- bipyrimidin]- 6(1H)-one US10195201, Example 37
Type:
Small organic molecule
Emp. Form.:
C19H18F2N4O
Mol. Mass.:
356.3692
SMILES:
CC(c1ccc(cc1)C(C)(F)F)c1cc(ncn1)-c1cc(=O)[nH]c(C)n1
: