Target
Hypoxia-inducible factor 1-alpha
Ligand
BDBM332036
Substrate
Meas. Tech.
Stabilization of HIF-1alpha
EC50
1020±340 nM
Citation
 Li, SXiao, JWang, LLong, LLi, WLuo, HLi, FZhong, WZheng, ZXie, YLi, XZhou, XWang, XCao, R Substituted acethydrazide derivative, preparation method and use thereof US Patent  US10196346 Publication Date 2/5/2019 
Target
Name:
Hypoxia-inducible factor 1-alpha
Synonyms:
BHLHE78 HIF-1-alpha, HIF-2-alpha HIF1A_HUMAN Hypoxia-inducible factor 1 alpha MOP1 von Hippel-Lindau disease tumor suppressor/Elongin-C/Elongin-B/HIF1A
Type:
Protein
Mol. Mass.:
92647.24
Organism:
Homo sapiens (Human)
Description:
Q16665
Residue:
826
  
Inhibitor
Name:
BDBM332036
Synonyms:
(E)-N'-[(2- hydroxynaphthalen-1- yl)methylene]-2-{N-{2-[N- (4-isopropylbenzyl)-N- methylamino]ethyl}N- methylamino}acethydrazide | US10196346, Example 14
Type:
Small organic molecule
Emp. Form.:
C27H34N4O2
Mol. Mass.:
446.5845
SMILES:
CC(C)c1ccc(CN(C)CCN(C)CC(=O)N\N=C\c2c(O)ccc3ccccc23)cc1
: