Target
Hypoxia-inducible factor 1-alpha
Ligand
BDBM332040
Substrate
Meas. Tech.
Stabilization of HIF-1alpha
EC50
2770±310 nM
Citation
 Li, SXiao, JWang, LLong, LLi, WLuo, HLi, FZhong, WZheng, ZXie, YLi, XZhou, XWang, XCao, R Substituted acethydrazide derivative, preparation method and use thereof US Patent  US10196346 Publication Date 2/5/2019 
Target
Name:
Hypoxia-inducible factor 1-alpha
Synonyms:
BHLHE78 HIF-1-alpha, HIF-2-alpha HIF1A_HUMAN Hypoxia-inducible factor 1 alpha MOP1 von Hippel-Lindau disease tumor suppressor/Elongin-C/Elongin-B/HIF1A
Type:
Protein
Mol. Mass.:
92647.24
Organism:
Homo sapiens (Human)
Description:
Q16665
Residue:
826
  
Inhibitor
Name:
BDBM332040
Synonyms:
(E)-N'-(3,5-di-tert-butyl-2- hydroxybenzal)-2-{N-{2- [N-(3-methoxybenzyl)-N- methylamino]ethyl}N- methylamino}acethydrazide | US10196346, Example 22
Type:
Small organic molecule
Emp. Form.:
C29H44N4O3
Mol. Mass.:
496.6847
SMILES:
COc1cccc(CN(C)CCN(C)CC(=O)N\N=C\c2cc(cc(c2O)C(C)(C)C)C(C)(C)C)c1
: