Target
Progesterone receptor
Ligand
BDBM332403
Substrate
Meas. Tech.
Progesterone Receptor Fluorescence Polarization Assay
IC50
316±n/a nM
Citation
 Turnbull, PSCadilla, R Chemical compounds US Patent  US10196353 Publication Date 2/5/2019 
Target
Name:
Progesterone receptor
Synonyms:
NR3C3 PGR PRGR_HUMAN | progesterone
Type:
Protein
Mol. Mass.:
98979.52
Organism:
Homo sapiens (Human)
Description:
P06401
Residue:
933
  
Inhibitor
Name:
BDBM332403
Synonyms:
US10196353, Example 21 | US11299457, Example 21
Type:
Small organic molecule
Emp. Form.:
C15H15F3N2O
Mol. Mass.:
296.2876
SMILES:
CC(n1ccc2c(c(ccc12)C#N)C(F)(F)F)C(C)(C)O
: