Target
Nuclear receptor ROR-gamma
Ligand
BDBM332433
Substrate
Meas. Tech.
Biological Assays
IC50
2.00±n/a nM
Citation
 Barr, KJBienstock, CEMaclean, JKZhang, HBeresis, RTZhang, DAnthony, NJLapointe, BTTian, Y 4-heteroaryl substituted benzoic acid compounds as RORgammaT inhibitors and uses thereof US Patent  US10196354 Publication Date 2/5/2019 
Target
Name:
Nuclear receptor ROR-gamma
Synonyms:
NR1F3 Nuclear receptor ROR-gamma (RORC) RAR-related orphan receptor C (RORc) RORG RZRG Retinoid-related orphan receptor-gamma (RORc)
Type:
Enzyme Catalytic Domain
Mol. Mass.:
58218.40
Organism:
Homo sapiens (Human)
Description:
P51449
Residue:
518
  
Inhibitor
Name:
BDBM332433
Synonyms:
4-(1-(2- chloro-6- cyclopropyl- benzoyl)-1H- indazol-3- yl)-3-fluoro- benzoic acid US9745265, 1AC
Type:
Small organic molecule
Emp. Form.:
C24H16ClFN2O3
Mol. Mass.:
434.847
SMILES:
OC(=O)c1ccc(-c2nn(C(=O)c3c(Cl)cccc3C3CC3)c3ccccc23)c(F)c1
: