Target
Nuclear receptor ROR-gamma
Ligand
BDBM332444
Substrate
Meas. Tech.
Biological Assays
IC50
1060±n/a nM
Citation
 Barr, KJBienstock, CEMaclean, JKZhang, HBeresis, RTZhang, DAnthony, NJLapointe, BTTian, Y 4-heteroaryl substituted benzoic acid compounds as RORgammaT inhibitors and uses thereof US Patent  US10196354 Publication Date 2/5/2019 
Target
Name:
Nuclear receptor ROR-gamma
Synonyms:
NR1F3 Nuclear receptor ROR-gamma (RORC) RAR-related orphan receptor C (RORc) RORG RZRG Retinoid-related orphan receptor-gamma (RORc)
Type:
Enzyme Catalytic Domain
Mol. Mass.:
58218.40
Organism:
Homo sapiens (Human)
Description:
P51449
Residue:
518
  
Inhibitor
Name:
BDBM332444
Synonyms:
4-(1-(2-chloro-6- (trifluoromethyl) benzoyl)-6-(3- hydroxypyrrolidin- 1-yl)-1H-indazol- 3-yl)-3- fluorobenzoic acid US9745265, 4G
Type:
Small organic molecule
Emp. Form.:
C26H18ClF4N3O4
Mol. Mass.:
547.885
SMILES:
OC1CCN(C1)c1ccc2c(nn(C(=O)c3c(Cl)cccc3C(F)(F)F)c2c1)-c1ccc(cc1F)C(O)=O
: