Target
Proteasome subunit alpha type-6
Ligand
BDBM50002338
Substrate
Meas. Tech.
Proteasome Activity Assay
pH
7.5±n/a
Temperature
310.15±n/a K
EC50
12000±0.0 nM
Comments
extracted
Citation
 Jones, CLNjomen, ESjögren, BDexheimer, TSTepe, JJ Small Molecule Enhancement of 20S Proteasome Activity Targets Intrinsically Disordered Proteins. ACS Chem Biol 12:2240-2247 (2017)  
Target
Name:
Proteasome subunit alpha type-6
Synonyms:
27 kDa prosomal protein Multicatalytic endopeptidase complex iota chain PROS27 PSMA6 p27K
Type:
PROTEIN
Mol. Mass.:
27399.66
Organism:
Homo sapiens (Human)
Description:
ChEMBL_106197
Residue:
246
  
Inhibitor
Name:
BDBM50002338
Synonyms:
(Thioridazine)10-[2-(1-Methyl-piperidin-2-yl)-ethyl]-2-methylsulfanyl-10H-phenothiazine 10-[2-(1-Methyl-piperidin-2-yl)-ethyl]-2-methylsulfanyl-10H-phenothiazine CHEMBL479 MELLARIL-S TP-21 | US9504692, Thioridazine
Type:
Small organic molecule
Emp. Form.:
C21H26N2S2
Mol. Mass.:
370.575
SMILES:
CSc1ccc2Sc3ccccc3N(CCC3CCCCN3C)c2c1
: