Target
High affinity nerve growth factor receptor [441-796]
Ligand
BDBM136597
Substrate
Meas. Tech.
ELISA Assay
pH
7.5±n/a
IC50
9.7±n/a nM
Comments
extracted
Citation
 Haas, JAndrews, SWJiang, YZhang, G Method of treatment using substituted pyrazolo[1,5-A] pyrimidine compounds US Patent  US9676783 Publication Date 6/13/2017 
Target
Name:
High affinity nerve growth factor receptor [441-796]
Synonyms:
MTC NTRK1_HUMAN TRKA Tyrosine kinase receptor A (TrkA)
Type:
Protein
Mol. Mass.:
39939.20
Organism:
Homo sapiens (Human)
Description:
Human his-tagged TrkA cytoplasmic domain (441-796 aa)
Residue:
356
  
Inhibitor
Name:
BDBM136597
Synonyms:
US10005783, 14 US10774085, Example 14 US11267818, Example 14 US8865698, 14 | US9676783, 14
Type:
Small organic molecule
Emp. Form.:
C21H22F2N6O2
Mol. Mass.:
428.4352
SMILES:
O[C@H]1CCN(C1)C(=O)Nc1cnn2ccc(nc12)N1CCC[C@@H]1c1cc(F)ccc1F
: