Target
G-protein coupled receptor 183
Ligand
BDBM332602
Substrate
Meas. Tech.
Cell-Based Luminescent Assay
IC50
35±n/a nM
Citation
 Pinkerton, ABArdecky, RSergienko, EAGonzalez-Lopez, MGanji, SRZou, J Spirocyclic EBI2 modulators US Patent  US10196369 Publication Date 2/5/2019 
Target
Name:
G-protein coupled receptor 183
Synonyms:
EBI2 GPR183
Type:
PROTEIN
Mol. Mass.:
41245.79
Organism:
Homo sapiens (Human)
Description:
ChEMBL_108311
Residue:
361
  
Inhibitor
Name:
BDBM332602
Synonyms:
6-bromoindol-2-yl 7-[(4-fluorophenyl)carbonyl]-2,7-diazaspiro[3.5]non-2-yl ketone | US10196369, Compound C57
Type:
Small organic molecule
Emp. Form.:
C23H21BrFN3O2
Mol. Mass.:
470.334
SMILES:
Fc1ccc(cc1)C(=O)N1CCC2(CN(C2)C(=O)c2cc3ccc(Br)cc3[nH]2)CC1
: