Target
G-protein coupled receptor 183
Ligand
BDBM332626
Substrate
Meas. Tech.
Cell-Based Luminescent Assay
IC50
12.5±n/a nM
Citation
 Pinkerton, ABArdecky, RSergienko, EAGonzalez-Lopez, MGanji, SRZou, J Spirocyclic EBI2 modulators US Patent  US10196369 Publication Date 2/5/2019 
Target
Name:
G-protein coupled receptor 183
Synonyms:
EBI2 GPR183
Type:
PROTEIN
Mol. Mass.:
41245.79
Organism:
Homo sapiens (Human)
Description:
ChEMBL_108311
Residue:
361
  
Inhibitor
Name:
BDBM332626
Synonyms:
3-(4-chlorophenyl)-1-{7-[(4-fluorophenyl)methyl]-2,7-diazaspiro[3.5]non-2-yl}prop-2-yn-1-one | US10196369, Compound C81
Type:
Small organic molecule
Emp. Form.:
C23H22ClFN2O
Mol. Mass.:
396.885
SMILES:
Fc1ccc(CN2CCC3(CN(C3)C(=O)C#Cc3ccc(Cl)cc3)CC2)cc1
: