Target
G-protein coupled receptor 183
Ligand
BDBM332638
Substrate
Meas. Tech.
Cell-Based Luminescent Assay
IC50
35±n/a nM
Citation
 Pinkerton, ABArdecky, RSergienko, EAGonzalez-Lopez, MGanji, SRZou, J Spirocyclic EBI2 modulators US Patent  US10196369 Publication Date 2/5/2019 
Target
Name:
G-protein coupled receptor 183
Synonyms:
EBI2 GPR183
Type:
PROTEIN
Mol. Mass.:
41245.79
Organism:
Homo sapiens (Human)
Description:
ChEMBL_108311
Residue:
361
  
Inhibitor
Name:
BDBM332638
Synonyms:
3-(4-fluorophenyl)-1-{7-[(4-fluorophenyl)carbonyl]-2,7-diazaspiro[3.5]non-2-yl}prop-2-yn-1-one | US10196369, Compound C93
Type:
Small organic molecule
Emp. Form.:
C23H20F2N2O2
Mol. Mass.:
394.4139
SMILES:
Fc1ccc(cc1)C#CC(=O)N1CC2(C1)CCN(CC2)C(=O)c1ccc(F)cc1
: