Target
Signal transducer and activator of transcription 3
Ligand
BDBM50440937
Substrate
Meas. Tech.
Chromatin Immunoprecipitation (CHIP)
Ki
4800±600 nM
Citation
 Turkson, JGunning, P Substituted 2-hydroxy-4-(2-(phenylsulfonamido)acetamido)benzoic acid analogs as inhibitors of STAT protein US Patent  US10196373 Publication Date 2/5/2019 
Target
Name:
Signal transducer and activator of transcription 3
Synonyms:
APRF STAT3_HUMAN Signal transducer and activator of transcription 3 (STAT3)
Type:
Protein
Mol. Mass.:
88064.31
Organism:
Homo sapiens (Human)
Description:
P40763
Residue:
770
  
Inhibitor
Name:
BDBM50440937
Synonyms:
CHEMBL2431944 | US10196373, Compound XW1-057
Type:
Small organic molecule
Emp. Form.:
C37H37F3N2O6S2
Mol. Mass.:
726.825
SMILES:
Cc1ccc(cc1)S(=O)(=O)N(CC(=O)N(Cc1ccc(cc1)C1CCCCC1)c1ccc(C(O)=O)c(O)c1)Cc1ccc(SC(F)(F)F)cc1
: