Target
Cyclin-dependent kinase 2/G1/S-specific cyclin-E1
Ligand
BDBM12604
Substrate
GST-Rb fusion protein
Meas. Tech.
Homogeneous Time-resolved Fluorescence (HTRF) Assay
pH
7±n/a
Temperature
310.15±n/a K
Ki
5141±n/a nM
Citation
 Chu, XJDePinto, WBartkovitz, DSo, SSVu, BTPackman, KLukacs, CDing, QJiang, NWang, KGoelzer, PYin, XSmith, MAHiggins, BXChen, YXiang, QMoliterni, JKaplan, GGraves, BLovey, AFotouhi, N Discovery of [4-Amino-2-(1-methanesulfonylpiperidin-4-ylamino)pyrimidin-5-yl](2,3-difluoro-6-methoxyphenyl)methanone (R547), a potent and selective cyclin-dependent kinase inhibitor with significant in vivo antitumor activity. J Med Chem 49:6549-60 (2006)  
Target
Name:
Cyclin-dependent kinase 2/G1/S-specific cyclin-E1
Synonyms:
CDK2/CycE CDK2/E Cyclin-Dependent Kinase 2 (CDK2) Cyclin-dependent kinase 2/cyclin E1
Type:
Protein
Mol. Mass.:
Description:
Components:
This complex has 2 components.
Component 1
Name:
Cyclin-dependent kinase 2
Synonyms:
CDK2 CDK2_HUMAN Cell division protein kinase 2 Protein cereblon/Cyclin-dependent kinase 2 | p33 protein kinase
Type:
Enzyme Subunit
Mol. Mass.:
33938.17
Organism:
Homo sapiens (Human)
Description:
P24941
Residue:
298
  
Component 2
Name:
G1/S-specific cyclin-E1
Synonyms:
CCNE CCNE1_HUMAN
Type:
Enzyme Subunit
Mol. Mass.:
47073.17
Organism:
Homo sapiens (Human)
Description:
Residue:
410
  
Inhibitor
Name:
BDBM12604
Synonyms:
2,4-Diamino-5-ketopyrimidine 22 [4-Amino-2-[4-(4-methylpiperazin-1-yl)phenylamino]pyrimidin-5-yl](2-methoxyphenyl)methanone
Type:
Small organic molecule
Emp. Form.:
C23H26N6O2
Mol. Mass.:
418.4915
SMILES:
COc1ccccc1C(=O)c1cnc(Nc2ccc(cc2)N2CCN(C)CC2)nc1N
:
Substrate
Name:
GST-Rb fusion protein
Synonyms:
Glutathione S-transferase (GST)-retinoblastoma (Rb) fusion RB1 Rb | retinoblastoma
Type:
Other Protein Type
Mol. Mass.:
106410.17
Organism:
Homo sapiens (Human)
Description:
GST-60 kDa Rb fusion protein (comprising amino acids 378 to 928 of retinoblastoma)
Residue:
928