Target
Glucocorticoid receptor
Ligand
BDBM332661
Substrate
Meas. Tech.
GRE Antagonist Assay
IC50
100±n/a nM
Citation
 Ripa, LELawitz, KLepistö, MJHemmerling, MEdman, KLLinas, A 1-alkyl-6-oxo-1,6-dihydropyridin-3-yl compounds and use as SGRM modulators US Patent  US10196374 Publication Date 2/5/2019 
Target
Name:
Glucocorticoid receptor
Synonyms:
GCR_HUMAN GRL Glucocorticoid receptor (GRFP) Nuclear receptor subfamily 3 group C member 1
Type:
Enzyme
Mol. Mass.:
85656.87
Organism:
Homo sapiens (Human)
Description:
P04150
Residue:
777
  
Inhibitor
Name:
BDBM332661
Synonyms:
Preparation of 2,2,2-trifluoro-N-[(1R,2S)-3-methyl-1-{[1-(1-methyl-6-oxo-1,6-dihydropyridin-3-yl)-1H-indazol-5-yl]oxy}-1-phenylbutan-2-yl]acetamide | US10196374, Example 2
Type:
Small organic molecule
Emp. Form.:
C26H25F3N4O3
Mol. Mass.:
498.4969
SMILES:
CC(C)[C@H](NC(=O)C(F)(F)F)[C@H](Oc1ccc2n(ncc2c1)-c1ccc(=O)n(C)c1)c1ccccc1
: