Target
Glucocorticoid receptor
Ligand
BDBM332682
Substrate
Meas. Tech.
GRE Antagonist Assay
IC50
100±n/a nM
Citation
 Ripa, LELawitz, KLepistö, MJHemmerling, MEdman, KLLinas, A 1-alkyl-6-oxo-1,6-dihydropyridin-3-yl compounds and use as SGRM modulators US Patent  US10196374 Publication Date 2/5/2019 
Target
Name:
Glucocorticoid receptor
Synonyms:
GCR_HUMAN GRL Glucocorticoid receptor (GRFP) Nuclear receptor subfamily 3 group C member 1
Type:
Enzyme
Mol. Mass.:
85656.87
Organism:
Homo sapiens (Human)
Description:
P04150
Residue:
777
  
Inhibitor
Name:
BDBM332682
Synonyms:
US10196374, Example 10
Type:
Small organic molecule
Emp. Form.:
C28H27F5N4O3
Mol. Mass.:
562.531
SMILES:
CC(C)[C@H](NC(=O)C(C)(F)F)[C@H](Oc1ccc2n(ncc2c1)-c1ccc(=O)n(C)c1)c1ccc(cc1)C(F)(F)F
: