Target
Proto-oncogene tyrosine-protein kinase Src
Ligand
BDBM332700
Substrate
Meas. Tech.
In Vitro Biochemical Assay
Ki
120±n/a nM
Citation
 Soellner, MBPhadke, S Inhibitors of BCR-ABL mutants and use thereof US Patent  US10196378 Publication Date 2/5/2019 
Target
Name:
Proto-oncogene tyrosine-protein kinase Src
Synonyms:
Calmodulin/Proto-oncogene tyrosine-protein kinase Src Proto-oncogene c-Src SRC SRC_HUMAN V-src sarcoma (Schmidt-Ruppin A-2) viral oncogene homolog (avian) p60-Src | pp60c-src
Type:
Protein
Mol. Mass.:
59838.60
Organism:
Homo sapiens (Human)
Description:
P12931
Residue:
536
  
Inhibitor
Name:
BDBM332700
Synonyms:
US10196378, Compound C03
Type:
Small organic molecule
Emp. Form.:
C28H27F3N6O2
Mol. Mass.:
536.5482
SMILES:
CN1CCN(Cc2ccc(NC(=O)Nc3ccc(Oc4ccc5ncncc5c4)cc3)cc2C(F)(F)F)CC1
: