Target
Tyrosine-protein kinase ABL1
Ligand
BDBM332706
Substrate
Meas. Tech.
In Vitro Biochemical Assay
Ki
3.30±n/a nM
Citation
 Soellner, MBPhadke, S Inhibitors of BCR-ABL mutants and use thereof US Patent  US10196378 Publication Date 2/5/2019 
Target
Name:
Tyrosine-protein kinase ABL1
Synonyms:
ABL ABL1_HUMAN JTK7 Proto-oncogene tyrosine-protein kinase ABL1 Tyrosine-protein kinase ABL V-abl Abelson murine leukemia viral oncogene homolog 1 p150 | tyrosine-protein kinase ABL1 isoform a
Type:
Enzyme
Mol. Mass.:
122897.30
Organism:
Homo sapiens (Human)
Description:
P00519
Residue:
1130
  
Inhibitor
Name:
BDBM332706
Synonyms:
US10196378, Compound C09 | US10196378, Compound C10
Type:
Small organic molecule
Emp. Form.:
C32H28N6O2
Mol. Mass.:
528.6037
SMILES:
CC(C)(C)c1cc(NC(=O)Nc2ccc(Oc3ccc4cccnc4c3)cc2)n(n1)-c1ccc2ncccc2c1
: