Target
Poly [ADP-ribose] polymerase 1
Ligand
BDBM332708
Substrate
Meas. Tech.
HT Universal Chemiluminescent PARP Assay Kit
IC50
48±n/a nM
Citation
 Fan, XQin, J Benzimidazole-2-piperazine heterocyclic compound, pharmaceutical composition containing the same, preparation method and use thereof US Patent  US10196381 Publication Date 2/5/2019 
Target
Name:
Poly [ADP-ribose] polymerase 1
Synonyms:
(ARTD1 or PARP1) 2.4.2.30 ADPRT ARTD1 Human diphtheria toxin-like ADP-ribosyltransferase (ARTD1 or PARP1) NT-PARP-1 PARP1 PPOL Poly [ADP-ribose] polymerase 1 (PARP) Poly [ADP-ribose] polymerase 1 (PARP1) Poly [ADP-ribose] polymerase 1, 28-kDa form Poly [ADP-ribose] polymerase 1, processed C-terminus Poly [ADP-ribose] polymerase-1 Poly(ADP-ribose) polymerase-1 (ARTD1/PARP1) Protein poly-ADP-ribosyltransferase PARP1 | Synonyms=ADPRT
Type:
Mol. Mass.:
113114.22
Organism:
Homo sapiens (Human)
Description:
P09874
Residue:
1014
  
Inhibitor
Name:
BDBM332708
Synonyms:
US10196381, Compound (1)
Type:
Small organic molecule
Emp. Form.:
C16H17N7O
Mol. Mass.:
323.3525
SMILES:
NC(=O)c1cccc2[nH]c(nc12)N1CCN(CC1)c1ncccn1
: