Target
Poly [ADP-ribose] polymerase 1
Ligand
BDBM332738
Substrate
Meas. Tech.
HT Universal Chemiluminescent PARP Assay Kit
IC50
25±n/a nM
Citation
 Fan, XQin, J Benzimidazole-2-piperazine heterocyclic compound, pharmaceutical composition containing the same, preparation method and use thereof US Patent  US10196381 Publication Date 2/5/2019 
Target
Name:
Poly [ADP-ribose] polymerase 1
Synonyms:
(ARTD1 or PARP1) 2.4.2.30 ADPRT ARTD1 Human diphtheria toxin-like ADP-ribosyltransferase (ARTD1 or PARP1) NT-PARP-1 PARP1 PPOL Poly [ADP-ribose] polymerase 1 (PARP) Poly [ADP-ribose] polymerase 1 (PARP1) Poly [ADP-ribose] polymerase 1, 28-kDa form Poly [ADP-ribose] polymerase 1, processed C-terminus Poly [ADP-ribose] polymerase-1 Poly(ADP-ribose) polymerase-1 (ARTD1/PARP1) Protein poly-ADP-ribosyltransferase PARP1 | Synonyms=ADPRT
Type:
Mol. Mass.:
113114.22
Organism:
Homo sapiens (Human)
Description:
P09874
Residue:
1014
  
Inhibitor
Name:
BDBM332738
Synonyms:
2-(4-(5-t-butylcarbamoylpyrazin-2-yl)piperazin-1-yl)-6-fluoro-1H-benzimidazole-4-carboxamide | US10196381, Compound (28)
Type:
Small organic molecule
Emp. Form.:
C21H25FN8O2
Mol. Mass.:
440.474
SMILES:
CC(C)CNC(=O)c1cnc(cn1)N1CCN(CC1)c1nc2c(cc(F)cc2[nH]1)C(N)=O
: