Target
Glutaminase kidney isoform, mitochondrial
Ligand
BDBM332753
Substrate
Meas. Tech.
GLS Enzyme Potency Assay
IC50
95.7±n/a nM
Citation
 Finlay, MR bis-Pyridazine compounds and their use in treating cancer US Patent  US10196382 Publication Date 2/5/2019 
Target
Name:
Glutaminase kidney isoform, mitochondrial
Synonyms:
GLS GLSK_HUMAN K-glutaminase L-glutamine amidohydrolase
Type:
Protein
Mol. Mass.:
73471.89
Organism:
Homo sapiens (Human)
Description:
O94925
Residue:
669
  
Inhibitor
Name:
BDBM332753
Synonyms:
(2S)-2-[3-(Trifluoromethoxy)phenyl]-2-methoxy-N-[6-[(3R)-3-(pyridazin-3-ylamino)pyrrolidin-1-yl]pyridazin-3-yl]acetamide US10577354, Example 2
Type:
Small organic molecule
Emp. Form.:
C22H22F3N7O3
Mol. Mass.:
489.4504
SMILES:
CO[C@H](C(=O)Nc1ccc(nn1)N1CC[C@H](C1)Nc1cccnn1)c1cccc(OC(F)(F)F)c1
: