Target
Glutaminase kidney isoform, mitochondrial
Ligand
BDBM332757
Substrate
Meas. Tech.
GLS Enzyme Potency Assay
IC50
25.2±n/a nM
Citation
 Finlay, MR bis-Pyridazine compounds and their use in treating cancer US Patent  US10196382 Publication Date 2/5/2019 
Target
Name:
Glutaminase kidney isoform, mitochondrial
Synonyms:
GLS GLSK_HUMAN K-glutaminase L-glutamine amidohydrolase
Type:
Protein
Mol. Mass.:
73471.89
Organism:
Homo sapiens (Human)
Description:
O94925
Residue:
669
  
Inhibitor
Name:
BDBM332757
Synonyms:
N-[6-[(3R)-3-(Pyridazin-3-ylamino)pyrrolidin-1-yl]pyridazin-3-yl]-2-[2-(trifluoromethoxy)phenyl]acetamide US10577354, Example 6
Type:
Small organic molecule
Emp. Form.:
C21H20F3N7O2
Mol. Mass.:
459.4244
SMILES:
FC(F)(F)Oc1ccccc1CC(=O)Nc1ccc(nn1)N1CC[C@H](C1)Nc1cccnn1
: